{"text_format":"1","workbook":"xlsx","n_sheets":10,"sheets":["Menú P.","ForEntrFX","Mod_FichaX","FichaX","ORGFUN2018","CENTRO","U.T.","ECON","Ficha Libre","Personalización"],"not_rendered":{"charts":0,"images":1,"macros":1,"external_links":0,"defined_names":2,"comments":3,"pivot_tables":0},"unopened":[],"bounds":{"document_bytes":16777216,"sheet_cells":100000,"rows_first":2000,"rows_last":500,"rows_between":2000,"halvings":0,"cell_chars":16384,"cell_head_chars":4096},"cells_cut":0,"cells_raw":0,"read":"whole","date_system":"1900"}

{"sheet":"Menú P.","index":0,"n_rows":11,"n_cols":3,"rows_kept":11,"cut":false,"hidden":false,"merged":[[2,2,2,4]]}
[]
[]
[null,null,{"$f":"CONCATENATE(Personalización!D4,\"  \",Personalización!C6)","v":"   "}]
[null,null,"     "]
[]
[null,"Inicio","Personalizar  a Folla "]
[]
[]
[null,null,"Encher formulario  con todas as partidas do centro para a programación anual da actividade contractual do centro."]
[]
[null,null,"Para modificar unha entrada xa realizada no formulario"]

{"sheet":"ForEntrFX","index":1,"n_rows":55,"n_cols":37,"rows_kept":55,"cut":false,"hidden":false,"merged":[[3,2,3,5],[49,28,49,29],[49,34,49,35],[11,2,12,2],[15,2,16,2],[20,2,20,3],[21,2,21,3]]}
[]
[]
[]
[null,null,{"$f":"CONCATENATE(Personalización!D4,\"  \",Personalización!C6)","v":"   "}]
[]
[]
[]
[]
[]
[]
[null,null,null,"Nº Asento",{"$f":"AB52","v":1}]
[null,null,"Aplicación orzamentaria ","Orgánica e Funcional",null,null,{"$f":"IF(ISBLANK(E12),\" \",VLOOKUP(E12,ORGFUN2018!$A:$B,2,0))","v":" "}]
[null,null,null,"Económica",null,null,{"$f":"IF(ISBLANK(E13),\" \",VLOOKUP(E13,ECON!$A:$B,2,0))","v":" "}]
[null,null,"Importe con IVE","Importe"]
[null,null,"Descrición da Obra, subministro ou Servizo. ","Detallarase de forma xenérica o material que vamos a adquirir, posteriormente faráse unha ficha detallada co número de líneas que se necesite."]
[null,null,"Prazo de execución","  Data Inicio  - (dd/mm/aa)"]
[null,null,null,"  Data fin……. - (dd/mm/aa)"]
[]
[]
[]
[]
[]
[]
[]
[]
[]
[]
[]
[]
[]
[]
[]
[]
[]
[]
[]
[]
[]
[]
[]
{"$rows_left_out":16}
{"sheet":"Mod_FichaX","index":2,"n_rows":60,"n_cols":36,"rows_kept":60,"cut":false,"hidden":false,"merged":[[4,1,4,4],[56,33,56,34],[12,1,13,1],[18,1,19,1],[16,27,17,27],[56,27,56,28]]}
[]
[]
[]
[]
[null,{"$f":"CONCATENATE(Personalización!D4,\"  \",Personalización!C6)","v":"   "}]
[]
[]
[]
[]
[]
[null,null,null,null,null,null,null,null,null,null,null,null,null,null,null,null,null,null,null,null,null,null,null,null,null,null,null,null,null,"Módulo restauración"]
[null,"Nº Asento a modificar"]
[null,"Aplicación orzamentaria ","Orgánica e Funcional",{"$f":"IF(ISBLANK($C$12),\" \",VLOOKUP($C$12,FichaX!$A:$I,2,0))","v":" "},{"$f":"$D$13","v":" "},null,null,null,null,null,null,null,null,null,null,null,null,null,null,null,null,null,null,null,null,null,null,null,null,{"$f":"$D$13","v":" "}]
[null,null,"Económica",{"$f":"IF(ISBLANK($C$12),\" \",VLOOKUP($C$12,FichaX!$A:$I,3,0))","v":" "},{"$f":"$D$14","v":" "},null,null,null,null,null,null,null,null,null,null,null,null,null,null,null,null,null,null,null,null,null,null,null,null,{"$f":"$D$14","v":" "}]
[null,{"$f":"IF(ISBLANK($D$13),\" \",VLOOKUP($D$13,ORGFUN2018!$A:$B,2,0))","v":{"$error":"#N/A"}},null,null,{"$f":"IF(ISBLANK($E13),\" \",VLOOKUP($E$13,ORGFUN2018!$A:$B,2,0))","v":{"$error":"#N/A"}},null,null,null,null,null,null,null,null,null,null,null,null,null,null,null,null,null,null,null,null,null,null,null,null,{"$f":"IF(ISBLANK($E13),\" \",VLOOKUP($E$13,ORGFUN2018!$A:$B,2,0))","v":{"$error":"#N/A"}}]
[null,{"$f":"IF(ISBLANK($D$14),\" \",VLOOKUP($D$14,ECON!$A:$B,2,0))","v":{"$error":"#N/A"}},null,null,{"$f":"IF(ISBLANK($E$14),\" \",VLOOKUP($E$14,ECON!$A:$B,2,0))","v":{"$error":"#N/A"}},null,null,null,null,null,null,null,null,null,null,null,null,null,null,null,null,null,null,null,null,null,null,null,null,{"$f":"IF(ISBLANK($E$14),\" \",VLOOKUP($E$14,ECON!$A:$B,2,0))","v":{"$error":"#N/A"}}]
[null,"Importe con IVE","Importe",{"$f":"IF(ISBLANK($C$12),\" \",VLOOKUP($C$12,FichaX!$A:$I,6,0))","v":" "},{"$f":"$D$17","v":" "},null,null,null,null,null,null,null,null,null,null,null,null,null,null,null,null,null,null,null,null,null,null,null,null,{"$f":"$D$17","v":" "}]
[null,"Descrición da Obra, subministro ou Servizo. ",{"$f":"IF(ISBLANK($C$12),\" \",VLOOKUP($C$12,FichaX!$A:$I,7,0))","v":" "},"Detallarase de forma xenérica o material que vamos a adquirir, posteriormente faráse unha ficha detallada co número de líneas que se necesite.",{"$f":"$C$18","v":" "},null,null,null,null,null,null,null,null,null,null,null,null,null,null,null,null,null,null,null,null,null,null,null,null,{"$f":"$C$18","v":" "}]
[null,"Prazo de execución","  Data Inicio  - (dd/mm/aa)",{"$f":"IF(ISBLANK($C$12),\" \",VLOOKUP($C$12,FichaX!$A:$I,8,0))","v":" "},{"$f":"$D$19","v":" "},null,null,null,null,null,null,null,null,null,null,null,null,null,null,null,null,null,null,null,null,null,null,null,null,{"$f":"$D$19","v":" "}]
[null,null,"  Data fin……. - (dd/mm/aa)",{"$f":"IF(ISBLANK($C$12),\" \",VLOOKUP($C$12,FichaX!$A:$I,9,0))","v":" "},{"$f":"$D$20","v":" "},null,null,null,null,null,null,null,null,null,null,null,null,null,null,null,null,null,null,null,null,null,null,null,null,{"$f":"$D$20","v":" "}]
[]
[]
[]
[]
[]
[]
[]
[]
[]
[]
[]
[]
[]
[]
[]
[]
[]
[]
[]
[]
{"$rows_left_out":21}
{"sheet":"FichaX","index":3,"n_rows":525,"n_cols":10,"rows_kept":525,"cut":false,"hidden":false,"merged":[[3,1,3,2],[3,7,3,8],[0,4,0,5],[3,6,4,6],[1,1,1,4]]}
[]
[null,{"$f":"CONCATENATE(Personalización!D4,\"  \",Personalización!C6)","v":"   "},null,null,null,null,null,null,"Control modificación",{"$f":"Mod_FichaX!C12","v":0}]
[]
[null,"Aplicación orzamentaria ",null,"Título da aplicación orzamentaria","Título da aplicación económica","Importe","Descrición da Obra, Subministro ou Servizo.","Plazo de execución"]
["Nº asento","Orgánica Funcional","Económica",null,"(Debe ser adecuada á natureza do gasto)",null,null,"Data Incio","Data Fin","control modificación"]
[0,null,null,null,null,null,null,null,null,{"$f":"IF($J$2=A6,1,0)","v":1}]
[null,null,null,null,null,null,null,null,null,1]
[null,null,null,null,null,null,null,null,null,1]
[null,null,null,null,null,null,null,null,null,1]
[null,null,null,null,null,null,null,null,null,1]
[null,null,null,null,null,null,null,null,null,1]
[null,null,null,null,null,null,null,null,null,1]
[null,null,null,null,null,null,null,null,null,1]
[null,null,null,null,null,null,null,null,null,1]
[null,null,null,null,null,null,null,null,null,1]
[null,null,null,null,null,null,null,null,null,1]
[null,null,null,null,null,null,null,null,null,1]
[null,null,null,null,null,null,null,null,null,1]
[null,null,null,null,null,null,null,null,null,1]
[null,null,null,null,null,null,null,null,null,1]
[null,null,null,null,null,null,null,null,null,1]
[null,null,null,null,null,null,null,null,null,1]
[null,null,null,null,null,null,null,null,null,1]
[null,null,null,null,null,null,null,null,null,1]
[null,null,null,null,null,null,null,null,null,1]
[null,null,null,null,null,null,null,null,null,1]
[null,null,null,null,null,null,null,null,null,1]
[null,null,null,null,null,null,null,null,null,1]
[null,null,null,null,null,null,null,null,null,1]
[null,null,null,null,null,null,null,null,null,1]
[null,null,null,null,null,null,null,null,null,1]
[null,null,null,null,null,null,null,null,null,1]
[null,null,null,null,null,null,null,null,null,1]
[null,null,null,null,null,null,null,null,null,1]
[null,null,null,null,null,null,null,null,null,1]
[null,null,null,null,null,null,null,null,null,1]
[null,null,null,null,null,null,null,null,null,1]
[null,null,null,null,null,null,null,null,null,{"$f":"IF($J$2=A38,1,0)","v":1}]
[null,null,null,null,null,null,null,null,null,1]
[null,null,null,null,null,null,null,null,null,1]
{"$rows_left_out":486}
{"sheet":"ORGFUN2018","index":4,"n_rows":2351,"n_cols":6,"rows_kept":2351,"cut":false,"hidden":true,"merged":[]}
["ORGANICA FUNCIONAL","DESCRICION_ORGANICA","ORGANICA","FUNCIONAL","DESCRICIÓN FUNCIONAL"]
["0100 122B","SECRETARÍA XERAL","0100","122B","BIBLIOTECAS","SE(ENBRANCO(D2);\" \";BUSCARV(D2;'FUN2018'!$A:$D;2;0))"]
["0100 422D","SECRETARÍA XERAL","0100","422D","ENSINANZA UNIVERSITARIA"]
["0100010001 422D","25  ANIVERSARIO DA UDC. SRIA XERAL","0100010001","422D","ENSINANZA UNIVERSITARIA"]
["0100010002 422D","AXUDA 2015,XUNTA,CONS.CULT.ED.e OU ,EN MATERIA DE ARQUIVOS. SRIA.XERAL.","0100010002","422D","ENSINANZA UNIVERSITARIA"]
["0100010003 422D","XORN.COMUNIC.E RESPONSABILIDADE SOCIAL ,ORGANIZA REGACUE","0100010003","422D","ENSINANZA UNIVERSITARIA"]
["01000102 422D","GABINETE DE COMUNICACIÓN E MEDIOS AUDIOVISUAIS","01000102","422D","ENSINANZA UNIVERSITARIA"]
["01000105 422D","SERVIZO DE REXISTRO, DOCUMENTACIÓN E ARQUIVO","01000105","422D","ENSINANZA UNIVERSITARIA"]
["01000107 422D","SERVIZO DE NORMALIZACIÓN LINGÜÍSTICA","01000107","422D","ENSINANZA UNIVERSITARIA"]
["0100010701 422D","C.VERAN 2016-PROF.RIOS NOYA-XII CURSO VERAN SOBRE DINAMIZACION LINGUISTICA.TRABALLANDO EN LINGUA.DINAMIZACION DA LINGUA NO SECTOR SOCIOECONOMICO","0100010701","422D","ENSINANZA UNIVERSITARIA"]
["0100010702 422D","C.VERÁN.2015 (XI), SERV. NORM.LINGÜÍSTICA.: DINAMIZACIÓN LINGÜÍSTICA, TRAB. EN LINGUA?","0100010702","422D","ENSINANZA UNIVERSITARIA"]
["0100010703 422D","CONV. 13-ACTVD. DE FORMACIÓN- CURSO EILC. SERV. DE NORMALIZACIÓN","0100010703","422D","ENSINANZA UNIVERSITARIA"]
["01000107C1 422D","2018 XIV CURSO DE VERÁN SOBRE DINAMIZACIÓN LINGUISTICA, TRABALLANDO EN LINGUA NA MUSICA","01000107C1","422D","ENSINANZA UNIVERSITARIA"]
["01000108 422D","XESTOR DE RELAC. CIENTF. TEC.- SEC. XERAL","01000108","422D","ENSINANZA UNIVERSITARIA"]
["0100440093 422D","CONV.2018,XUNTA,C.EDUC.ACTUACIÓNS MAT.NORMALIZ.LINGÏÍSTICA.Sº.NORMLING.SRÍA.X.","0100440093","422D","ENSINANZA UNIVERSITARIA"]
["0100470102 422D","XORN.COMUNIC.E RESPONSABILIDADE SOCIAL ,ORGANIZA REGACUE","0100470102","422D","ENSINANZA UNIVERSITARIA"]
["0200 100A","VICERREITORÍA DE ECONOMÍA, INFRAESTRUCTURAS E SUSTENTABILIDADE","0200","100A","EQUILIBRIO FINANCEIRO"]
["0200 422D","VICERREITORÍA DE ECONOMÍA, INFRAESTRUCTURAS E SUSTENTABILIDADE","0200","422D","ENSINANZA UNIVERSITARIA"]
["0200 541A","VICERREITORÍA DE ECONOMÍA, INFRAESTRUCTURAS E SUSTENTABILIDADE","0200","541A","INVESTIGACIÓN"]
["0200020001 422D","REPRESENTANTES UDC NO CES GALICIA","0200020001","422D","ENSINANZA UNIVERSITARIA"]
["0200020003 422D","C. VERÁN 14 - OFIC. M. AMBIENTE \"INICIATIVAS DE CONSERV. AMBIENTAL E PARTIC. SOCIAL.\"","0200020003","422D","ENSINANZA UNIVERSITARIA"]
["0200020004 422D","EXECUCIÓN SENTENZA ALDESA , S.A.","0200020004","422D","ENSINANZA UNIVERSITARIA"]
["0200020005 422D","OFICINA DE MEDIO AMBIENTE","0200020005","422D","ENSINANZA UNIVERSITARIA"]
["0200280091 422D","PROX. 2017, ALCOA FUNDATION-EDUCATING FOR ENVIROMENTAL CONSCIOUNESS. PROF: MANUEL SOTO","0200280091","422D","ENSINANZA UNIVERSITARIA"]
["0200440097 422D","CONV.XUNTA 16/17 .ACTUAC.A)CENTROS INNOVACIÓN TECNOLÓXICA UDC","0200440097","422D","ENSINANZA UNIVERSITARIA"]
["0200440097 541A","CONV.XUNTA 16/17 .ACTUAC.A)CENTROS INNOVACIÓN TECNOLÓXICA UDC","0200440097","541A","INVESTIGACIÓN"]
["0200440098 541A","REFORZO DE CAPITAL HUMANO:CICA E ESCI. 2017-2018","0200440098","541A","INVESTIGACIÓN"]
["0200440100 422D","CONV.XUNTA ,DESENVOLVEMENTO DE ACCIÓNS DE I+D+I","0200440100","422D","ENSINANZA UNIVERSITARIA"]
["0200440100 541A","CONV.XUNTA ,DESENVOLVEMENTO DE ACCIÓNS DE I+D+I","0200440100","541A","INVESTIGACIÓN"]
["020044A220 422D","CONV.XUNTA,2018,ACTUACIÓN 2) CAMPUS DE ESPECIALIZACIÓN.","020044A220","422D","ENSINANZA UNIVERSITARIA"]
["020044A320 422D","CONV.XUNTA 2018, ACTUACIÓN 3) INVESTIMENTO MATERIAL E INMATERIAL","020044A320","422D","ENSINANZA UNIVERSITARIA"]
["0200460002 422D","CONVENIO  14/09/16, CONCELLO DA CORUÑA,INFRAESTRUCTURAS E ESPAZOS URBANOS USO PEONIL","0200460002","422D","ENSINANZA UNIVERSITARIA"]
["0200460014 422D","CONV.2016. C.CORUÑA RENOVAC.PISTA ATLETÍSMO ESTADIO CAMPUS ELVIÑA","0200460014","422D","ENSINANZA UNIVERSITARIA"]
["0300 422D","VICERREITORÍA DE ESTUDANTES, PARTICIPACIÓN E EXTENSIÓN UNIVERSITARIA","0300","422D","ENSINANZA UNIVERSITARIA"]
["0300 541A","VICERREITORÍA DE ESTUDANTES, PARTICIPACIÓN E EXTENSIÓN UNIVERSITARIA","0300","541A","INVESTIGACIÓN"]
["0300030001 422D","CURSOS/ XORNADAS PROFESORES. VEPEU","0300030001","422D","ENSINANZA UNIVERSITARIA"]
["0300030002 422D","COMP.DEGASTOSDESPRAZAMENTOPROFESORES.PROGR.OTEUFUTURO","0300030002","422D","ENSINANZA UNIVERSITARIA"]
["0300030003 422D","AULA NAÚTICA -VEPEU","0300030003","422D","ENSINANZA UNIVERSITARIA"]
["0300030004 422D","C.VERÁN 14- PROF. GONZÁLEZ TIZÓN- \"CIENCIAS FORENSES NA INVESTIGACIÓN\"","0300030004","422D","ENSINANZA UNIVERSITARIA"]
["0300030005 422D","II CURSO VERÁN.2015,ORIENTATE E PLANIFICA O TEU FUTURO.PROF.ÁLVAREZ GARCÍA","0300030005","422D","ENSINANZA UNIVERSITARIA"]
{"$rows_left_out":2312}
{"sheet":"CENTRO","index":5,"n_rows":34,"n_cols":1,"rows_kept":34,"cut":false,"hidden":true,"merged":[]}
["CENTRO DE INNOVACIÓN TÉCNICA EN EDIFICACIÓN E ENXEÑERÍA CIVIL (CITEEC)"]
["CENTRO DE INNOVACIÓN TECNOLÓXICA (CIT)"]
["CENTRO DE INVESTIGACIÓN EN TECNOLOXÍAS DA INFORMACIÓN E AS COMUNICACIÓNS (CITIC)"]
["CONSELLO SOCIAL"]
["ESCOLA POLITÉCNICA SUPERIOR "]
["ESCOLA TÉCNICA SUPERIOR DE ARQUITECTURA"]
["ESCOLA TÉCNICA SUPERIOR DE ENXEÑEIROS DE CAMIÑOS, CANAIS E PORTOS"]
["ESCOLA TÉCNICA SUPERIOR DE NÁUTICA E MÁQUINAS"]
["ESCOLA UNIVERSITARIA DE ARQUITECTURA TÉCNICA"]
["ESCOLA UNIVERSITARIA POLITÉCNICA"]
["FACULTADE DE CIENCIAS"]
["FACULTADE DE CIENCIAS DA EDUCACIÓN"]
["FACULTADE DE CIENCIAS DO DEPORTE E A EDUCACIÓN FÍSICA"]
["FACULTADE DE DEREITO"]
["FACULTADE DE ECONOMÍA E EMPRESA"]
["FACULTADE DE FILOLOXÍA"]
["FACULTADE DE INFORMÁTICA"]
["INSTITUTO UNIVERSITARIO DE CIENCIAS DA SAÚDE"]
["INSTITUTO UNIVERSITARIO DE ESTUDOS EUROPEOS"]
["INSTITUTO UNIVERSITARIO DE ESTUDOS IRLANDESES"]
["INSTITUTO UNIVERSITARIO DE ESTUDOS MARÍTIMOS"]
["INSTITUTO UNIVERSITARIO DE MEDIO AMBIENTE"]
["INSTITUTO UNIVERSITARIO DE XEOLOXÍA"]
["OFICINA DE RELACIÓNS INTERNACIONAIS (ORI)"]
["OFICINA DE TRANSFERENCIA DE RESULTADOS E INVESTIGACIÓN (OTRI)"]
["SERVIZO DE BIBLIOTECA UNIVERSITARIA"]
["SERVIZO DE EXTENSIÓN UNIVERSITARIA"]
["SERVIZO DE INVESTIGACIÓN"]
["SERVIZO DE PATRIMONIO INVENTARIO E XESTIÓN ECONÓMICA"]
["SERVIZOS DE APOIO Á INVESTIGACIÓN (SAI)"]
["UXAI ELVIÑA"]
["UXAI FERROL"]
["UXAI OZA"]
["VICERREITORÍA DO CAMPUS DE FERROL E RESPONSABILIDADE SOCIAL"]

{"sheet":"U.T.","index":6,"n_rows":47,"n_cols":2,"rows_kept":47,"cut":false,"hidden":true,"merged":[]}
["0100","SERVIZO DE PATRIMONIO INVENTARIO E XESTIÓN ECONÓMICA"]
["0200","SERVIZO DE PATRIMONIO INVENTARIO E XESTIÓN ECONÓMICA"]
["0300","SECCION DE EXTENSIÓN UNIVERSITARIA"]
["0305","SERVIZO DE EXTENSIÓN UNIVERSITARIA"]
["0400","SERVIZO DE PATRIMONIO INVENTARIO E XESTIÓN ECONÓMICA"]
["0500","SERVIZO DE INVESTIGACIÓN"]
["0502","SERVIZO DE BIBLIOTECA UNIVERSITARIA"]
["0503","CENTRO DE INVESTIGACIÓN EN TECNOLOXÍAS DA INFORMACIÓN E AS COMUNICACIÓNS (CITIC)"]
["0504","SERVIZOS DE APOIO Á INVESTIGACIÓN (SAI)"]
["0505","OFICINA DE TRANSFERENCIA DE RESULTADOS E INVESTIGACIÓN (OTRI)"]
["0506","CENTRO DE INNOVACIÓN TÉCNICA EN EDIFICACIÓN E ENXEÑERÍA CIVIL (CITEEC)"]
["0507","CENTRO DE INNOVACIÓN TECNOLÓXICA (CIT)"]
["0512","ESCOLA POLITÉCNICA SUPERIOR "]
["0513","OFICINA DE RELACIÓNS INTERNACIONAIS (ORI)"]
["0522","INSTITUTO UNIVERSITARIO DE XEOLOXÍA"]
["0524","INSTITUTO UNIVERSITARIO DE ESTUDOS EUROPEOS"]
["0526","INSTITUTO UNIVERSITARIO DE MEDIO AMBIENTE"]
["0527","INSTITUTO UNIVERSITARIO DE ESTUDOS IRLANDESES"]
["0528","INSTITUTO UNIVERSITARIO DE CIENCIAS DA SAÚDE"]
["0529","INSTITUTO UNIVERSITARIO DE ESTUDOS MARÍTIMOS"]
["0700","SERVIZO DE PATRIMONIO INVENTARIO E XESTIÓN ECONÓMICA"]
["0800","SERVIZO DE PATRIMONIO INVENTARIO E XESTIÓN ECONÓMICA"]
["0900","VICERREITORÍA DO CAMPUS DE FERROL E RESPONSABILIDADE SOCIAL"]
["1000","SERVIZO DE PATRIMONIO INVENTARIO E XESTIÓN ECONÓMICA"]
["1100","CONSELLO SOCIAL"]
["1300","SERVIZO DE PATRIMONIO INVENTARIO E XESTIÓN ECONÓMICA"]
["6100","FACULTADE DE CIENCIAS"]
["6120","FACULTADE DE DEREITO"]
["6130","FACULTADE DE FILOLOXÍA"]
["6140","FACULTADE DE INFORMÁTICA"]
["6150","FACULTADE DE SOCIOLOXÍA"]
["6160","FACULTADE DE CIENCIAS DA COMUNICACIÓN"]
["6170","FACULTADE DE ECONOMÍA E EMPRESA"]
["6200","FACULTADE DE CIENCIAS DO DEPORTE E A EDUCACIÓN FÍSICA"]
["6300","ESCOLA TÉCNICA SUPERIOR DE ARQUITECTURA"]
["6310","ESCOLA TÉCNICA SUPERIOR DE NÁUTICA E MÁQUINAS"]
["6320","ESCOLA TÉCNICA SUPERIOR DE ENXEÑEIROS DE CAMIÑOS, CANAIS E PORTOS"]
["6510","FACULTADE DE FISIOTERAPIA"]
["6520","FACULTADE DE CIENCIAS DA EDUCACIÓN"]
["6530","FACULTADE DE CIENCIAS DO TRABALLO"]
{"$rows_left_out":8}
{"sheet":"ECON","index":7,"n_rows":266,"n_cols":2,"rows_kept":266,"cut":false,"hidden":true,"merged":[]}
["ECONOMICA","DESCRICION_ECONOMICA"]
[20000,"ARRENDAMENTOS TERREOS E BENS NATURAIS"]
[20200,"ARRENDAMENTO DE EDIFICIOS E OUTRAS CONSTRUCIÓNS"]
[20300,"MAQUINARIA "]
[20301,"INSTALACIÓNS"]
[20302,"UTENSILIOS"]
[20400,"ALUGUEIROS DE MATERIAL DE TRANSPORTE "]
[20500,"ARRENDAMENTO DE MOBILIARIO E AVÍOS"]
[20600,"ARRENDAMENTO DE SISTEMAS PARA PROCESOS DE INFORMACIÓN"]
[20800,"ARRENDAMENTO DOUTRO INMOBILIZADO MATERIAL "]
[20900,"CANONS "]
[20901,"LICENZAS-SOFTWARE"]
[20902,"DE ACCESO A SITIOS WEB E POLO USO DE PRODUTOS DIXITAIS"]
[20916,"DESENVOLVEMENTO E ALOXAMENTO WEB "]
[21000,"REPARAC.INFRAESTR. E BENS NATURAIS "]
[21200,"REPARACION MANTEM.CONSERV.EDIFICIOS E OUTRAS CONSTRUCC. "]
[21300,"MAQUINARIA"]
[21301,"INSTALACIÓNS"]
[21302,"UTENSILIOS"]
[21400,"REPARACIÓNS ELEMENTOS DE TRANSPORTE"]
[21500,"REPARACIÓNS MOBILIARIO E AVÍOS"]
[21600,"REPARACION E MANTEMENTO EQUIPOS PROCESOS INFORMACIÓN. "]
[21800,"MATERIAL BIBILIOGRÁFICO E DOCUMENTAL "]
[21900,"OUTRO MATERIAL INMOBILIZADO "]
[22000,"MATERIAL DE OFICINA DE USO ORDINARIO NON INVENTARIABLE"]
[22001,"PRENSA, REVISTAS, LIBROS E PUBLICACIÓNS "]
[22002,"MAT. OFICINA INFORMATICO NON INVENTARIABLE "]
[22003,"PRÉSTAMOS INTERBIBLIOTECARIOS"]
[22004,"RECURSOS DE INFORMACIÓN. BIBLIOTECAS"]
[22005,"SUBSCRICIÓNS PUBLICACIÓNS PERIÓDICAS"]
[22100,"ENERXÍA ELÉCTRICA "]
[22101,"AUGA "]
[22102,"GASES DE LABORATORIO "]
[22103,"COMBUSTIBLES, LUBRICANTES E ADITIVOS "]
[22104,"VESTUARIO "]
[22105,"EQUIPOS DE PROTECCIÓN INDIVIDUAL.EPI "]
[22106,"PRODUCTOS FARMACÉUTICOS E MATERIAL SANITARIO "]
[22107,"MATERIAL DOCENTE"]
[22108,"MATERIAL DEPORTIVO E CULTURAL "]
[22109,"LABORES DA FABRICA NAC, MOEDA E TIMBRE "]
{"$rows_left_out":227}
{"sheet":"Ficha Libre","index":8,"n_rows":20,"n_cols":9,"rows_kept":20,"cut":false,"hidden":false,"merged":[[4,1,4,2],[4,7,4,8],[0,4,0,5],[2,1,2,3]]}
[]
[]
[null,{"$f":"CONCATENATE(Personalización!D4,\"  \",Personalización!C6)","v":"   "}]
[]
[null,"Aplicación orzamentaria ",null,"Título da aplicación orzamentaria","Título da aplicación económica","Importe","Descrición da Obra, Subministro ou Servizo.","Plazo de execución"]
["Nº asento","Orgánica Funcional","Económica",null,"(Debe ser adecuada á natureza do gasto)",null,"(Detallarase o máis pormenorizadamente posible)","Data Incio","Data Fin"]
[1]
[2]
[3]
[4]
[5]
[6]
[7]
[8]
[9]
[10]
[11]
[12]
[13]
[14]

{"sheet":"Personalización","index":9,"n_rows":12,"n_cols":3,"rows_kept":12,"cut":false,"hidden":false,"merged":[[5,2,5,7],[36,3,36,5],[8,3,8,5],[11,3,11,5],[13,3,13,5],[16,3,16,5],[18,3,18,5],[21,3,21,5],[23,3,23,5],[26,3,26,5],[28,3,28,5],[31,3,31,5],[33,3,33,5]]}
[]
[]
[]
[null,null,"Código de centro de gasto"]
[]
[null,null,{"$f":"IF(ISBLANK(D4),\" \",VLOOKUP(D4,U.T.!$A:$B,2,0))","v":" "}]
[]
[]
[null,null,"Nome do xefe de negociado de Asuntos Económicos"]
[]
[]
[null,null,"Nome do Responsable do Centro de gasto"]